{"text_format":"3","workbook":"xlsx","n_sheets":2,"sheets":["Форма 1","Коды программ"],"not_rendered":{"images":1,"external_links":3},"read":"whole","date_system":"1900"}

{"sheet":"Форма 1","index":0,"n_rows":113,"n_cols":33,"rows_kept":113,"merged":[[1,1,1,32],[2,0,2,32],[4,0,6,0],[4,1,6,1],[4,2,6,2],[4,3,6,3],[4,4,6,4],[4,5,6,5],[4,6,4,30],[4,31,6,31],[4,32,6,32],[5,6,5,11],[5,12,5,14],[5,15,5,18],[5,19,5,24],[5,25,5,30]]}
[{"$nulls":4},{"$f":"MATCH(\"01\",D9:D23,0)","v":1},{"$nulls":27},"Приложение 2"]
[]
["Не допускается предоставление отчета в адрес Минпросвещения России образовательными организациями. Данные подаются региональным органом исполнительной власти по всем ОО СПО, расположенным на территории субъекта Российской Федерации, вне зависимости от ведомственной принадлежности\nЯчейки не объединяются.\nЯчейки с числовыми данными, одновременно содержащими текст или другие числовые значения, учитываться не будут. Формат ячеек с числовыми данными - только \"Числовой\"\nГрафы \"ПРОВЕРКА\" не удаляются и не редактируются\nФормулы логического контроля:\nгр. 09 и гр. 10 < гр. 08 \nсумма по видам деятельности (кроме граф \"в том числе\") равна суммарному выпуску в 2021 году (гр. 07= гр.08 + сумма(с гр.11 по гр.32))\nстр. 06 = стр. 02 + стр. 04\nстр. 06 = стр.07 + стр.08 + стр.09 + стр.10 + стр.11 + стр.12 + стр. 13\nстр. 14<=стр. 06, стр. 14<=стр 05 (<= означает \"меньше или равно\")"]
[]
["Наименование ПОО","Код профессии, специальности в формате хх.хх.хх в соответствии с приказом Минобрнауки России \nот 29 октября 2013 г. № 1199\n\n(выбрать из раскрывающегося списка, проверить графу 04)","Наименование профессии, специальности\n \n(добавляется автоматически при корректном вводе кода)","Номер строки","Наименование показателей \n(категория выпускников)\n\n(редактирование наименования \nне допускается)\n\n","Суммарный выпуск \n(человек)\n","Распределение выпускников по каналам занятости и иным видам деятельности, человек (каждый выпускник учитывается один раз. Единица измерения - человек)",{"$nulls":24},"Принимаемые меры по содействию занятости \n\n(тезисно - вид меры, охват выпускников мерой)","ПРОВЕРКА \n\n(сумма по всем категориям выпускников, распределенных по видам занятости, должна равняться сумме выпускников всего)"]
[{"$nulls":6},"Занятые выпускники",{"$nulls":5},"Потенциальная занятость (не относится к занятости по итогам обучения, требует дополнительных мер)",null,null,"Зона риска (требует оперативных мер и адресной работы)",{"$nulls":3},"Прочее, редкие жизненные обстоятельства",{"$nulls":5},"Профессиональные намерения выпускников, ожидаемый эффект от работы по содействию занятости (на ближайшую перспективу - порядка 3-х месяцев)"]
[{"$nulls":6},"Трудоустроены \n(по трудовому договору, договору ГПХ в соответствии с трудовым законодательством, законодательством  об обязательном пенсионном страховании)\n","\n\nВ том числе (из трудоустроенных): в соответствии с освоенной профессией, специальностью (исходя из осуществляемой трудовой функции)","\n\nВ том числе (из трудоустроенных): работают на протяжении не менее 4-х месяцев на последнем месте работы","Индиви-дуальные предприни-матели ","Самозанятые (перешедшие на специальный налоговый режим  - налог на профессио-нальный доход)","Продолжили обучение","Проходят службу в армии по призыву","Проходят службу в армии на контрактной основе, в органах внутренних дел, Государственной противопожарной службе, органах по контролю за оборотом наркотических средств и психотропных веществ, учреждениях и органах уголовно-исполнительной системы, войсках национальной гвардии Российской Федерации, органах принудительного исполнения Российской Федерации*\n","Находятся в отпуске по уходу \nза ребенком","Неформальная занятость (нелегальная)","Зарегистрированы в центрах занятости в качестве безработных (получают пособие по безработице) и не планируют трудоустраиваться","Не имеют мотивации к трудоустройству (кроме зарегистрированных в качестве безработных) и не планируют трудоустраиваться, в том числе по причинам получения иных социальных льгот ","Иные причины нахождения под риском нетрудоустройства","Смерть, тяжелое состояние здоровья","Находятся под следствием, отбывают наказание ","Переезд за пределы Российской Федерации\n\n(кроме переезда в иные регионы - по ним регион должен располагать сведениями)","Не могут трудоустраиваться в связи с уходом за больными родственниками, в связи с иными семейными обстоятельствами","Выпускники из числа иностранных граждан, которые не имеют СНИЛС","Иное\n \n(в первую очередь выпускники распределяются по всем остальным графам. Данная графа предназначена для очень редких случаев. Если в нее включено более 1 из 200 выпускников - укажите причины в гр. 33 ","будут трудоустроены","будут осуществлять предприни-мательскую деятельность","будут самозанятыми","будут призваны в армию","будут в армии на контрактной основе, в органах внутренних дел, Государственной противопожарной службе, органах по контролю за оборотом наркотических средств и психотропных веществ, учреждениях и органах уголовно-исполнительной системы, войсках национальной гвардии Российской Федерации, органах принудительного исполнения Российской Федерации*\n","будут продолжать обучение"]
[2,"03","04","05","06","07","08","09","10","11","12","13","14","15","16","17","18","19","20","21","22","23","24","25","26","27","28","29","30","31","32","33","34"]
["ГАПОУ \"Казанский колледж строительства,архитектуры и городского хозяйства\"","39.02.01",{"$f":"VLOOKUP(B9,'Коды программ'!$A$2:$B$578,2,FALSE)","v":"Социальная работа"},"01","Всего (общая численность выпускников)",20,10,3,0,0,0,5,0,0,0,5,0,0,0,0,0,0,0,0,0,0,0,0,0,0,0,null,{"$f":"IF(F9=G9+J9+K9+L9+M9+N9+O9+P9+Q9+R9+S9+T9+U9+V9+W9+X9+Y9+Z9+AA9+AB9+AC9+AD9+AE9,\"проверка пройдена\",\"ВНИМАНИЕ! Сумма по строке не сходится с общей численностью выпускников! Исправьте ошибку в расчетах, пока это сообщение не исчезнет!\")","v":"проверка пройдена"}]
["ГАПОУ \"Казанский колледж строительства,архитектуры и городского хозяйства\"","39.02.01",{"$f":"VLOOKUP(B10,'Коды программ'!$A$2:$B$578,2,FALSE)","v":"Социальная работа"},"02","из общей численности выпускников (из строки 01): лица с ОВЗ",0,0,0,0,0,0,0,0,0,0,0,0,0,0,0,0,0,0,0,0,0,0,0,0,0,0,null,{"$f":"IF(F10=G10+J10+K10+L10+M10+N10+O10+P10+Q10+R10+S10+T10+U10+V10+W10+X10+Y10+Z10+AA10+AB10+AC10+AD10+AE10,\"проверка пройдена\",\"ВНИМАНИЕ! Сумма по строке не сходится с общей численностью выпускников! Исправьте ошибку в расчетах, пока это сообщение не исчезнет!\")","v":"проверка пройдена"}]
["ГАПОУ \"Казанский колледж строительства,архитектуры и городского хозяйства\"","39.02.01",{"$f":"VLOOKUP(B11,'Коды программ'!$A$2:$B$578,2,FALSE)","v":"Социальная работа"},"03","из числа лиц с ОВЗ (из строки 02): инвалиды и дети-инвалиды",0,0,0,0,0,0,0,0,0,0,0,0,0,0,0,0,0,0,0,0,0,0,0,0,0,0,null,"проверка пройдена"]
["ГАПОУ \"Казанский колледж строительства,архитектуры и городского хозяйства\"","39.02.01",{"$f":"VLOOKUP(B12,'Коды программ'!$A$2:$B$578,2,FALSE)","v":"Социальная работа"},"04","Инвалиды и дети-инвалиды (кроме учтенных в строке 03)",0,0,0,0,0,0,0,0,0,0,0,0,0,0,0,0,0,0,0,0,0,0,0,0,0,0,null,"проверка пройдена"]
["ГАПОУ \"Казанский колледж строительства,архитектуры и городского хозяйства\"","39.02.01",{"$f":"VLOOKUP(B13,'Коды программ'!$A$2:$B$578,2,FALSE)","v":"Социальная работа"},"05","Имеют договор о целевом обучении",0,0,0,0,0,0,0,0,0,0,0,0,0,0,0,0,0,0,0,0,0,0,0,0,0,0,null,"проверка пройдена"]
["ГАПОУ \"Казанский колледж строительства,архитектуры и городского хозяйства\"","39.02.01",{"$f":"VLOOKUP(B14,'[1]Коды программ'!$A$2:$B$578,2,FALSE)","v":"Социальная работа"},"06","Автосумма строк 02 и 04 - Всего (общая численность выпускников из числа лиц с ОВЗ, инвалидов и детей-инвалидов) ",{"$f":"F10+F12","v":0},0,0,0,0,0,0,0,0,0,{"$f":"P10+P12","v":0},0,0,0,0,0,0,0,0,0,0,0,0,0,0,0,null,{"$f":"IF(F14=G14+J14+K14+L14+M14+N14+O14+P14+Q14+R14+S14+T14+U14+V14+W14+X14+Y14+Z14+AA14+AB14+AC14+AD14+AE14,\"проверка пройдена\",\"ВНИМАНИЕ! Сумма по строке не сходится с общей численностью выпускников! Исправьте ошибку в расчетах, пока это сообщение не исчезнет!\")","v":"проверка пройдена"}]
["ГАПОУ \"Казанский колледж строительства,архитектуры и городского хозяйства\"","39.02.01",{"$f":"VLOOKUP(B15,'[1]Коды программ'!$A$2:$B$578,2,FALSE)","v":"Социальная работа"},"07","из общей численности выпускников из числа лиц с ОВЗ, инвалидов и детей-инвалидов (из строки 06): с нарушениями:\n           зрения",0,0,0,0,0,0,0,0,0,0,0,0,0,0,0,0,0,0,0,0,0,0,0,0,0,0,null,{"$f":"IF(F15=G15+J15+K15+L15+M15+N15+O15+P15+Q15+R15+S15+T15+U15+V15+W15+X15+Y15+Z15+AA15+AB15+AC15+AD15+AE15,\"проверка пройдена\",\"ВНИМАНИЕ! Сумма по строке не сходится с общей численностью выпускников! Исправьте ошибку в расчетах, пока это сообщение не исчезнет!\")","v":"проверка пройдена"}]
["ГАПОУ \"Казанский колледж строительства,архитектуры и городского хозяйства\"","39.02.01",{"$f":"VLOOKUP(B16,'[1]Коды программ'!$A$2:$B$578,2,FALSE)","v":"Социальная работа"},"08","           слуха",0,0,0,0,0,0,0,0,0,0,0,0,0,0,0,0,0,0,0,0,0,0,0,0,0,0,null,{"$f":"IF(F16=G16+J16+K16+L16+M16+N16+O16+P16+Q16+R16+S16+T16+U16+V16+W16+X16+Y16+Z16+AA16+AB16+AC16+AD16+AE16,\"проверка пройдена\",\"ВНИМАНИЕ! Сумма по строке не сходится с общей численностью выпускников! Исправьте ошибку в расчетах, пока это сообщение не исчезнет!\")","v":"проверка пройдена"}]
["ГАПОУ \"Казанский колледж строительства,архитектуры и городского хозяйства\"","39.02.01",{"$f":"VLOOKUP(B17,'[1]Коды программ'!$A$2:$B$578,2,FALSE)","v":"Социальная работа"},"09","           опорно-двигательного аппарата",0,0,0,0,0,0,0,0,0,0,0,0,0,0,0,0,0,0,0,0,0,0,0,0,0,0,null,"проверка пройдена"]
["ГАПОУ \"Казанский колледж строительства,архитектуры и городского хозяйства\"","39.02.01",{"$f":"VLOOKUP(B18,'[1]Коды программ'!$A$2:$B$578,2,FALSE)","v":"Социальная работа"},"10","           тяжелыми нарушениями речи",0,0,0,0,0,0,0,0,0,0,0,0,0,0,0,0,0,0,0,0,0,0,0,0,0,0,null,"проверка пройдена"]
["ГАПОУ \"Казанский колледж строительства,архитектуры и городского хозяйства\"","39.02.01",{"$f":"VLOOKUP(B19,'[1]Коды программ'!$A$2:$B$578,2,FALSE)","v":"Социальная работа"},"11","           задержкой психического развития",0,0,0,0,0,0,0,0,0,0,0,0,0,{"$nulls":3},0,0,0,0,0,0,0,0,0,0,null,{"$f":"IF(F19=G19+J19+K19+L19+M19+N19+O19+P19+Q19+R19+S19+T19+U19+V19+W19+X19+Y19+Z19+AA19+AB19+AC19+AD19+AE19,\"проверка пройдена\",\"ВНИМАНИЕ! Сумма по строке не сходится с общей численностью выпускников! Исправьте ошибку в расчетах, пока это сообщение не исчезнет!\")","v":"проверка пройдена"}]
["ГАПОУ \"Казанский колледж строительства,архитектуры и городского хозяйства\"","39.02.01",{"$f":"VLOOKUP(B20,'[1]Коды программ'!$A$2:$B$578,2,FALSE)","v":"Социальная работа"},"12","           расстройствами аутистического\n           спектра",0,0,0,0,0,0,0,0,0,0,0,0,0,0,0,0,0,0,0,0,0,0,0,0,0,0,null,"проверка пройдена"]
["ГАПОУ \"Казанский колледж строительства,архитектуры и городского хозяйства\"","39.02.01",{"$f":"VLOOKUP(B21,'[1]Коды программ'!$A$2:$B$578,2,FALSE)","v":"Социальная работа"},"13","           с инвалидностью вследствие\n           других причин",0,0,0,0,0,0,0,0,0,0,0,0,0,0,0,0,0,0,0,0,0,0,0,0,0,0,null,"проверка пройдена"]
["ГАПОУ \"Казанский колледж строительства,архитектуры и городского хозяйства\"","39.02.01",{"$f":"VLOOKUP(B22,'[1]Коды программ'!$A$2:$B$578,2,FALSE)","v":"Социальная работа"},"14","из общей численности выпускников из числа лиц с ОВЗ, инвалидов и детей-инвалидов (из строки 06): имеют договор о целевом обучении",0,0,0,0,0,0,0,0,0,0,0,0,0,0,0,0,0,0,0,0,0,0,0,0,0,0,null,"проверка пройдена"]
["ГАПОУ \"Казанский колледж строительства,архитектуры и городского хозяйства\"","39.02.01",{"$f":"VLOOKUP(B23,'[1]Коды программ'!$A$2:$B$578,2,FALSE)","v":"Социальная работа"},"15","из общей численности выпускников из числа лиц с ОВЗ, инвалидов и детей-инвалидов (из строки 06): принимали участие в чемпионате «Абилимпикс»",0,0,0,0,0,0,0,0,0,0,0,0,0,0,0,0,0,0,0,0,0,0,0,0,0,0,null,"проверка пройдена"]
["ГАПОУ \"Казанский колледж строительства,архитектуры и городского хозяйства\"","38.02.01",{"$f":"VLOOKUP(B24,'Коды программ'!$A$2:$B$578,2,FALSE)","v":"Экономика и бухгалтерский учет (по отраслям)"},"01","Всего (общая численность выпускников)",15,11,7,0,0,0,0,0,0,0,4,0,0,0,0,0,0,0,0,0,0,0,0,0,0,0,null,{"$f":"IF(F24=G24+J24+K24+L24+M24+N24+O24+P24+Q24+R24+S24+T24+U24+V24+W24+X24+Y24+Z24+AA24+AB24+AC24+AD24+AE24,\"проверка пройдена\",\"ВНИМАНИЕ! Сумма по строке не сходится с общей численностью выпускников! Исправьте ошибку в расчетах, пока это сообщение не исчезнет!\")","v":"проверка пройдена"}]
["ГАПОУ \"Казанский колледж строительства,архитектуры и городского хозяйства\"","38.02.01",{"$f":"VLOOKUP(B25,'Коды программ'!$A$2:$B$578,2,FALSE)","v":"Экономика и бухгалтерский учет (по отраслям)"},"02","из общей численности выпускников (из строки 01): лица с ОВЗ",0,0,null,null,0,0,0,0,0,0,0,0,0,0,0,0,0,null,null,0,0,0,0,0,0,0,null,{"$f":"IF(F25=G25+J25+K25+L25+M25+N25+O25+P25+Q25+R25+S25+T25+U25+V25+W25+X25+Y25+Z25+AA25+AB25+AC25+AD25+AE25,\"проверка пройдена\",\"ВНИМАНИЕ! Сумма по строке не сходится с общей численностью выпускников! Исправьте ошибку в расчетах, пока это сообщение не исчезнет!\")","v":"проверка пройдена"}]
["ГАПОУ \"Казанский колледж строительства,архитектуры и городского хозяйства\"","38.02.01",{"$f":"VLOOKUP(B26,'Коды программ'!$A$2:$B$578,2,FALSE)","v":"Экономика и бухгалтерский учет (по отраслям)"},"03","из числа лиц с ОВЗ (из строки 02): инвалиды и дети-инвалиды",0,0,0,0,0,0,0,0,0,0,0,0,0,0,0,0,0,0,0,0,0,0,0,0,0,0,null,"проверка пройдена"]
["ГАПОУ \"Казанский колледж строительства,архитектуры и городского хозяйства\"","38.02.01",{"$f":"VLOOKUP(B27,'Коды программ'!$A$2:$B$578,2,FALSE)","v":"Экономика и бухгалтерский учет (по отраслям)"},"04","Инвалиды и дети-инвалиды (кроме учтенных в строке 03)",0,0,0,0,0,0,0,0,0,0,0,0,0,0,0,0,0,0,0,0,0,0,0,0,0,0,null,"проверка пройдена"]
["ГАПОУ \"Казанский колледж строительства,архитектуры и городского хозяйства\"","38.02.01",{"$f":"VLOOKUP(B28,'Коды программ'!$A$2:$B$578,2,FALSE)","v":"Экономика и бухгалтерский учет (по отраслям)"},"05","Имеют договор о целевом обучении",0,0,0,0,0,0,0,0,0,0,0,0,0,0,0,0,0,0,0,0,0,0,0,0,0,0,null,"проверка пройдена"]
["ГАПОУ \"Казанский колледж строительства,архитектуры и городского хозяйства\"","38.02.01",{"$f":"VLOOKUP(B29,'[1]Коды программ'!$A$2:$B$578,2,FALSE)","v":"Экономика и бухгалтерский учет (по отраслям)"},"06","Автосумма строк 02 и 04 - Всего (общая численность выпускников из числа лиц с ОВЗ, инвалидов и детей-инвалидов) ",{"$f":"F25+F27","v":0},{"$f":"G25+G27","v":0},0,0,0,0,0,0,0,0,0,0,0,0,0,0,0,0,0,0,0,0,0,0,0,0,null,{"$f":"IF(F29=G29+J29+K29+L29+M29+N29+O29+P29+Q29+R29+S29+T29+U29+V29+W29+X29+Y29+Z29+AA29+AB29+AC29+AD29+AE29,\"проверка пройдена\",\"ВНИМАНИЕ! Сумма по строке не сходится с общей численностью выпускников! Исправьте ошибку в расчетах, пока это сообщение не исчезнет!\")","v":"проверка пройдена"}]
["ГАПОУ \"Казанский колледж строительства,архитектуры и городского хозяйства\"","38.02.01",{"$f":"VLOOKUP(B30,'[1]Коды программ'!$A$2:$B$578,2,FALSE)","v":"Экономика и бухгалтерский учет (по отраслям)"},"07","из общей численности выпускников из числа лиц с ОВЗ, инвалидов и детей-инвалидов (из строки 06): с нарушениями:\n           зрения",0,{"$nulls":24},0,null,{"$f":"IF(F30=G30+J30+K30+L30+M30+N30+O30+P30+Q30+R30+S30+T30+U30+V30+W30+X30+Y30+Z30+AA30+AB30+AC30+AD30+AE30,\"проверка пройдена\",\"ВНИМАНИЕ! Сумма по строке не сходится с общей численностью выпускников! Исправьте ошибку в расчетах, пока это сообщение не исчезнет!\")","v":"проверка пройдена"}]
["ГАПОУ \"Казанский колледж строительства,архитектуры и городского хозяйства\"","38.02.01",{"$f":"VLOOKUP(B31,'[1]Коды программ'!$A$2:$B$578,2,FALSE)","v":"Экономика и бухгалтерский учет (по отраслям)"},"08","           слуха",0,0,0,0,0,0,0,0,0,0,0,0,0,0,0,0,0,0,0,0,0,0,0,0,0,0,null,{"$f":"IF(F31=G31+J31+K31+L31+M31+N31+O31+P31+Q31+R31+S31+T31+U31+V31+W31+X31+Y31+Z31+AA31+AB31+AC31+AD31+AE31,\"проверка пройдена\",\"ВНИМАНИЕ! Сумма по строке не сходится с общей численностью выпускников! Исправьте ошибку в расчетах, пока это сообщение не исчезнет!\")","v":"проверка пройдена"}]
["ГАПОУ \"Казанский колледж строительства,архитектуры и городского хозяйства\"","38.02.01",{"$f":"VLOOKUP(B32,'[1]Коды программ'!$A$2:$B$578,2,FALSE)","v":"Экономика и бухгалтерский учет (по отраслям)"},"09","           опорно-двигательного аппарата",0,0,0,0,0,0,0,0,0,0,0,0,0,0,0,0,0,0,0,0,0,0,0,0,0,0,null,"проверка пройдена"]
["ГАПОУ \"Казанский колледж строительства,архитектуры и городского хозяйства\"","38.02.01",{"$f":"VLOOKUP(B33,'[1]Коды программ'!$A$2:$B$578,2,FALSE)","v":"Экономика и бухгалтерский учет (по отраслям)"},"10","           тяжелыми нарушениями речи",0,0,0,0,0,0,0,0,0,0,0,0,0,0,0,0,0,0,0,0,0,0,0,0,0,0,null,"проверка пройдена"]
["ГАПОУ \"Казанский колледж строительства,архитектуры и городского хозяйства\"","38.02.01",{"$f":"VLOOKUP(B34,'[1]Коды программ'!$A$2:$B$578,2,FALSE)","v":"Экономика и бухгалтерский учет (по отраслям)"},"11","           задержкой психического развития",0,0,0,0,0,0,0,0,0,0,0,0,0,0,0,0,0,0,0,0,0,0,0,0,0,0,null,{"$f":"IF(F34=G34+J34+K34+L34+M34+N34+O34+P34+Q34+R34+S34+T34+U34+V34+W34+X34+Y34+Z34+AA34+AB34+AC34+AD34+AE34,\"проверка пройдена\",\"ВНИМАНИЕ! Сумма по строке не сходится с общей численностью выпускников! Исправьте ошибку в расчетах, пока это сообщение не исчезнет!\")","v":"проверка пройдена"}]
["ГАПОУ \"Казанский колледж строительства,архитектуры и городского хозяйства\"","38.02.01",{"$f":"VLOOKUP(B35,'[1]Коды программ'!$A$2:$B$578,2,FALSE)","v":"Экономика и бухгалтерский учет (по отраслям)"},"12","           расстройствами аутистического\n           спектра",0,0,0,0,0,0,0,0,0,0,0,0,0,0,0,0,0,0,0,0,0,0,0,0,0,0,null,{"$f":"IF(F35=G35+J35+K35+L35+M35+N35+O35+P35+Q35+R35+S35+T35+U35+V35+W35+X35+Y35+Z35+AA35+AB35+AC35+AD35+AE35,\"проверка пройдена\",\"ВНИМАНИЕ! Сумма по строке не сходится с общей численностью выпускников! Исправьте ошибку в расчетах, пока это сообщение не исчезнет!\")","v":"проверка пройдена"}]
["ГАПОУ \"Казанский колледж строительства,архитектуры и городского хозяйства\"","38.02.01",{"$f":"VLOOKUP(B36,'[1]Коды программ'!$A$2:$B$578,2,FALSE)","v":"Экономика и бухгалтерский учет (по отраслям)"},"13","           с инвалидностью вследствие\n           других причин",1,1,1,0,0,0,{"$nulls":19},0,null,"проверка пройдена"]
["ГАПОУ \"Казанский колледж строительства,архитектуры и городского хозяйства\"","38.02.01",{"$f":"VLOOKUP(B37,'[1]Коды программ'!$A$2:$B$578,2,FALSE)","v":"Экономика и бухгалтерский учет (по отраслям)"},"14","из общей численности выпускников из числа лиц с ОВЗ, инвалидов и детей-инвалидов (из строки 06): имеют договор о целевом обучении",0,0,0,0,0,0,0,0,0,0,0,0,0,0,0,0,0,0,0,0,0,0,0,0,0,0,null,"проверка пройдена"]
["ГАПОУ \"Казанский колледж строительства,архитектуры и городского хозяйства\"","38.02.01",{"$f":"VLOOKUP(B38,'[1]Коды программ'!$A$2:$B$578,2,FALSE)","v":"Экономика и бухгалтерский учет (по отраслям)"},"15","из общей численности выпускников из числа лиц с ОВЗ, инвалидов и детей-инвалидов (из строки 06): принимали участие в чемпионате «Абилимпикс»",1,1,1,0,0,0,0,0,0,0,0,0,0,0,0,0,0,0,0,0,0,0,0,0,0,0,null,"проверка пройдена"]
["ГАПОУ \"Казанский колледж строительства,архитектуры и городского хозяйства\"","08.02.11",{"$f":"VLOOKUP(B39,'Коды программ'!$A$2:$B$578,2,FALSE)","v":"Управление, эксплуатация и обслуживание многоквартирного дома"},"01","Всего (общая численность выпускников)",18,10,2,0,0,0,6,0,0,2,0,0,0,0,0,0,0,0,0,0,0,0,0,0,0,0,null,{"$f":"IF(F39=G39+J39+K39+L39+M39+N39+O39+P39+Q39+R39+S39+T39+U39+V39+W39+X39+Y39+Z39+AA39+AB39+AC39+AD39+AE39,\"проверка пройдена\",\"ВНИМАНИЕ! Сумма по строке не сходится с общей численностью выпускников! Исправьте ошибку в расчетах, пока это сообщение не исчезнет!\")","v":"проверка пройдена"}]
["ГАПОУ \"Казанский колледж строительства,архитектуры и городского хозяйства\"","08.02.11",{"$f":"VLOOKUP(B40,'Коды программ'!$A$2:$B$578,2,FALSE)","v":"Управление, эксплуатация и обслуживание многоквартирного дома"},"02","из общей численности выпускников (из строки 01): лица с ОВЗ",0,0,0,0,0,0,0,0,0,0,0,0,0,0,0,0,0,0,0,0,0,0,0,0,0,0,null,{"$f":"IF(F40=G40+J40+K40+L40+M40+N40+O40+P40+Q40+R40+S40+T40+U40+V40+W40+X40+Y40+Z40+AA40+AB40+AC40+AD40+AE40,\"проверка пройдена\",\"ВНИМАНИЕ! Сумма по строке не сходится с общей численностью выпускников! Исправьте ошибку в расчетах, пока это сообщение не исчезнет!\")","v":"проверка пройдена"}]
{"$rows_left_out":74}
{"sheet":"Коды программ","index":1,"n_rows":578,"n_cols":11,"rows_kept":578}
["Коды и наименования образовательных программ",null,"Ведомственная принадлежность",null,"Тип",null,"Регионы",{"$nulls":3},"ФО"]
["05.01.01","Гидрометнаблюдатель","федеральная",null,"ПОО",null,"Алтайский край",{"$nulls":3},"ДФО"]
["05.02.01","Картография","региональная",null,"ОО ВО",null,"Амурская \n область",{"$nulls":3},"ПФО"]
["05.02.02","Гидрология","муниципальная",{"$nulls":3},"Архангельская область",{"$nulls":3},"СЗФО"]
["05.02.03","Метеорология","частная",{"$nulls":3},"Астраханская область",{"$nulls":3},"СКФО"]
["07.02.01","Архитектура",{"$nulls":4},"Белгородская область",{"$nulls":3},"СФО"]
["08.01.01","Изготовитель арматурных сеток и каркасов",{"$nulls":4},"Брянская область",{"$nulls":3},"УФО"]
["08.01.02","Монтажник трубопроводов",{"$nulls":4},"Владимирская область",{"$nulls":3},"ЦФО"]
["08.01.03","Трубоклад",{"$nulls":4},"Волгоградская область",{"$nulls":3},"ЮФО"]
["08.01.04","Кровельщик",{"$nulls":4},"Вологодская область"]
["08.01.05","Мастер столярно-плотничных и паркетных работ",{"$nulls":4},"Воронежская область"]
["08.01.06","Мастер сухого строительства",{"$nulls":4},"город Москва"]
["08.01.07","Мастер общестроительных работ",{"$nulls":4},"город Санкт-Петербург"]
["08.01.08","Мастер отделочных строительных работ",{"$nulls":4},"город Севастополь"]
["08.01.09","Слесарь по строительно-монтажным работам",{"$nulls":4},"Еврейская автономная область"]
["08.01.10","Мастер жилищно-коммунального хозяйства",{"$nulls":4},"Забайкальский край"]
["08.01.11","Машинист машин и оборудования в производстве цемента",{"$nulls":4},"Ивановская область"]
["08.01.12","Оператор технологического оборудования в производстве стеновых и вяжущих материалов",{"$nulls":4},"Иркутская область"]
["08.01.13","Изготовитель железобетонных изделий",{"$nulls":4},"Кабардино-Балкарская республика"]
["08.01.14","Монтажник санитарно-технических, вентиляционных систем и оборудования",{"$nulls":4},"Калининградская область"]
["08.01.15","Слесарь по изготовлению деталей и узлов технических систем в строительстве",{"$nulls":4},"Калужская область"]
["08.01.16","Электромонтажник по сигнализации, централизации и блокировке",{"$nulls":4},"Камчатский край"]
["08.01.17","Электромонтажник-наладчик",{"$nulls":4},"Карачаево-Черкесская Республика"]
["08.01.18","Электромонтажник электрических сетей и электрооборудования",{"$nulls":4},"Кемеровская область - Кузбасс"]
["08.01.19","Электромонтажник по силовым сетям и электрооборудованию",{"$nulls":4},"Кировская область"]
["08.01.20","Электромонтажник по электрическим машинам",{"$nulls":4},"Костромская область"]
["08.01.21","Монтажник электрических подъемников (лифтов)",{"$nulls":4},"Краснодарский край"]
["08.01.22","Мастер путевых машин",{"$nulls":4},"Красноярский край"]
["08.01.23","Бригадир-путеец",{"$nulls":4},"Курганская область"]
["08.01.24","Мастер столярно-плотничных, паркетных и стекольных работ",{"$nulls":4},"Курская область"]
["08.01.25","Мастер отделочных строительных и декоративных работ",{"$nulls":4},"Ленинградская область"]
["08.01.26","Мастер по ремонту и обслуживанию инженерных систем жилищно-коммунального хозяйства",{"$nulls":4},"Липецкая область"]
["08.02.01","Строительство и эксплуатация зданий и сооружений",{"$nulls":4},"Магаданская область"]
["08.02.02","Строительство и эксплуатация инженерных сооружений",{"$nulls":4},"Московская область"]
["08.02.03","Производство неметаллических строительных изделий и конструкций",{"$nulls":4},"Мурманская область"]
["08.02.04","Водоснабжение и водоотведение",{"$nulls":4},"Ненецкий автономный округ"]
["08.02.05","Строительство и эксплуатация автомобильных дорог и аэродромов",{"$nulls":4},"Нижегородская область"]
["08.02.06","Строительство и эксплуатация городских путей сообщения",{"$nulls":4},"Новгородская область"]
["08.02.07","Монтаж и эксплуатация внутренних сантехнических устройств, кондиционирования воздуха и вентиляции",{"$nulls":4},"Новосибирская область"]
["08.02.08","Монтаж и эксплуатация оборудования и систем газоснабжения",{"$nulls":4},"Омская область"]
{"$rows_left_out":538}